Reaction Details
TargetCholesterol side-chain cleavage enzyme, mitochondrial
LigandBDBM50335519
Substrate/Competitorn/a
Meas. Tech.ChEMBL_63921 (CHEMBL677328)
IC50 2600±n/a nM
Citation Goldman, RCBaizman, ERBranstrom, AALongley, CB Differential antibacterial activity of moenomycin analogues on gram-positive bacteria. Bioorg Med Chem Lett10:2251-4 (2000) Cholesterol side-chain cleavage enzyme, mitochondrial
Name:Cholesterol side-chain cleavage enzyme, mitochondrial
Type:PROTEIN
Mol. Mass.:60603.33
Organism:Rattus norvegicus
Description:ChEMBL_50353
Residue:526
BDBM50335519
NameBDBM50335519
Synonyms:(S)-3,6-Diamino-hexanoic acid {(3S,9S,12S,15S)-3-((S)-6-hydroxy-2-imino-hexahydro-pyrimidin-4-yl)-9,12-bis-hydroxymethyl-2,5,8,11,14-pentaoxo-6-[1-ureido-meth-(Z)-ylidene]-1,4,7,10,13pentaaza-cyclohexadec-15-yl}-amide CHEMBL262777 Glycopeptide antibiotic Mannopeptimycin glycopeptide analogue Poly ethylene glycol derivative Vancocin Vancor vancomycin | vanomycin
TypeSmall organic molecule
Emp. Form.C66H75Cl2N9O24
Mol. Mass.1449.254
SMILESCN[C@H](CC(C)C)C(=O)N[C@@H]1[C@H](O)c2ccc(Oc3cc4cc(Oc5ccc(cc5Cl)[C@@H](O)[C@@H]5NC(=O)[C@H](NC(=O)[C@@H]4NC(=O)[C@H](CC(N)=O)NC1=O)c1ccc(O)c(c1)-c1c(O)cc(O)cc1[C@H](NC5=O)C(O)=O)c3O[C@@H]1O[C@H](CO)[C@@H](O)[C@H](O)[C@H]1O[C@H]1C[C@](C)(N)[C@H](O)[C@H](C)O1)c(Cl)c2