Reaction Details
TargetGlycylpeptide N-tetradecanoyltransferase 1/2
LigandBDBM96235
Substrate/Competitorn/a
Meas. Tech.ChEMBL_141169 (CHEMBL750519)
IC50 980±n/a nM
Citation Masubuchi, MKawasaki, KEbiike, HIkeda, YTsujii, SSogabe, SFujii, TSakata, KShiratori, YAoki, YOhtsuka, TShimma, N Design and synthesis of novel benzofurans as a new class of antifungal agents targeting fungal N-myristoyltransferase. Part 1. Bioorg Med Chem Lett11:1833-7 (2001) Glycylpeptide N-tetradecanoyltransferase 1/2
Name:Glycylpeptide N-tetradecanoyltransferase 1/2
Synonyms:Peptide N-myristoyltransferase
Type:n/a
Mol. Mass.:n/a
Description:ASSAY_ID of ChEMBL is 141178
Components:This complex has 2 components.
Component 1
Name:Glycylpeptide N-tetradecanoyltransferase 2
Type:PROTEIN
Mol. Mass.:56986.61
Organism:Homo sapiens (Human)
Description:ChEMBL_1435042
Residue:498
Component 2
Name:Glycylpeptide N-tetradecanoyltransferase 1
Synonyms:Myristoyl-CoA:protein N-myristoyltransferase (Nmt) NMT NMT1_HUMAN Peptide N-myristoyltransferase 1
Type:Enzyme
Mol. Mass.:56814.10
Organism:Homo sapiens (Human)
Description:P30419
Residue:496
BDBM96235
NameBDBM96235
Synonyms:4-[2-hydroxy-3-(isopropylamino)propoxy]-3-methyl-coumarilic acid ethyl ester;hydrochloride CHEMBL53849 Non peptidic, 1 cid_6602742 ethyl 4-[2-hydroxy-3-(propan-2-ylamino)propoxy]-3-methyl-1-benzofuran-2-carboxylate;hydrochloride
TypeSmall organic molecule
Emp. Form.C18H25NO5
Mol. Mass.335.3948
SMILESCCOC(=O)c1oc2cccc(OCC(O)CNC(C)C)c2c1C