Reaction Details
TargetMuscarinic acetylcholine receptor M5
LigandBDBM50219393
Substrate/Competitorn/a
Meas. Tech.ChEMBL_139512 (CHEMBL748269)
Ki 1230±n/a nM
Citation Böhme, TMKeim, CDannhardt, GMutschler, ELambrecht, G Design and pharmacology of quinuclidine derivatives as M2-selective muscarinic receptor ligands. Bioorg Med Chem Lett11:1241-3 (2001) Muscarinic acetylcholine receptor M5
Name:Muscarinic acetylcholine receptor M5
Type:PROTEIN
Mol. Mass.:60102.35
Organism:Homo sapiens (Human)
Description:ChEMBL_1517990
Residue:532
BDBM50219393
NameBDBM50219393
Synonyms:CHEMBL21321
TypeSmall organic molecule
Emp. Form.C23H22N2O2
Mol. Mass.358.433
SMILESO=C(OC1CN2CCC1CC2)C1=C\C(=C/c2cccnc2)c2ccccc12