Reaction Details
TargetMuscarinic acetylcholine receptor M2
LigandBDBM50219393
Substrate/Competitorn/a
Meas. Tech.ChEMBL_139885 (CHEMBL857563)
Ki 417±n/a nM
Citation Böhme, TMKeim, CDannhardt, GMutschler, ELambrecht, G Design and pharmacology of quinuclidine derivatives as M2-selective muscarinic receptor ligands. Bioorg Med Chem Lett11:1241-3 (2001) Muscarinic acetylcholine receptor M2
Name:Muscarinic acetylcholine receptor M2
Type:GPCR
Mol. Mass.:51730.61
Organism:Homo sapiens (Human)
Description:P08172
Residue:466
BDBM50219393
NameBDBM50219393
Synonyms:CHEMBL21321
TypeSmall organic molecule
Emp. Form.C23H22N2O2
Mol. Mass.358.433
SMILESO=C(OC1CN2CCC1CC2)C1=C\C(=C/c2cccnc2)c2ccccc12