Reaction Details
TargetNeuraminidase
LigandBDBM50219982
Substrate/Competitorn/a
Meas. Tech.ChEMBL_200646 (CHEMBL802980)
IC50 13.3±n/a nM
Citation Honda, TMasuda, TYoshida, SArai, MKobayashi, YYamashita, M Synthesis and anti-influenza virus activity of 4-guanidino-7-substituted Neu5Ac2en derivatives. Bioorg Med Chem Lett12:1921-4 (2002) Neuraminidase
Name:Neuraminidase
Type:Enzyme
Mol. Mass.:50124.14
Organism:Influenza A virus (A/Puerto Rico/8/34/Mount Sinai(H1N1))
Description:P03468
Residue:454
BDBM50219982
NameBDBM50219982
Synonyms:CHEMBL436160
TypeSmall organic molecule
Emp. Form.C15H23F3N4O9
Mol. Mass.460.3597
SMILES[#8]-[#6](=O)C(F)(F)F.[H][C@]1([#8]-[#6](=[#6]-[#6@H](\[#7]=[#6](/[#7])-[#7])-[#6@H]1-[#7]-[#6](-[#6])=O)-[#6](-[#8])=O)[#6@H](-[#8]-[#6])-[#6@H](-[#8])-[#6]-[#8]