Reaction Details
TargetNeuraminidase
LigandBDBM50219994
Substrate/Competitorn/a
Meas. Tech.ChEMBL_200640 (CHEMBL802974)
IC50 18.4±n/a nM
Citation Honda, TMasuda, TYoshida, SArai, MKaneko, SYamashita, M Synthesis and anti-influenza virus activity of 7-O-alkylated derivatives related to zanamivir. Bioorg Med Chem Lett12:1925-8 (2002) Neuraminidase
Name:Neuraminidase
Type:Enzyme
Mol. Mass.:50124.14
Organism:Influenza A virus (A/Puerto Rico/8/34/Mount Sinai(H1N1))
Description:P03468
Residue:454
BDBM50219994
NameBDBM50219994
Synonyms:CHEMBL56541
TypeSmall organic molecule
Emp. Form.C18H28F3N5O10
Mol. Mass.531.4376
SMILES[#8]-[#6](=O)C(F)(F)F.[H][C@]1([#8]-[#6](=[#6]-[#6@H](\[#7]=[#6](/[#7])-[#7])-[#6@H]1-[#7]-[#6](-[#6])=O)-[#6](-[#8])=O)[#6@H](-[#8]-[#6]-[#6]-[#7]-[#6](-[#6])=O)-[#6@H](-[#8])-[#6]-[#8]