Reaction Details
TargetNeuraminidase
LigandBDBM50219992
Substrate/Competitorn/a
Meas. Tech.ChEMBL_200641 (CHEMBL802975)
IC50 11.4±n/a nM
Citation Honda, TMasuda, TYoshida, SArai, MKaneko, SYamashita, M Synthesis and anti-influenza virus activity of 7-O-alkylated derivatives related to zanamivir. Bioorg Med Chem Lett12:1925-8 (2002) Neuraminidase
Name:Neuraminidase
Type:Enzyme
Mol. Mass.:50124.14
Organism:Influenza A virus (A/Puerto Rico/8/34/Mount Sinai(H1N1))
Description:P03468
Residue:454
BDBM50219992
NameBDBM50219992
Synonyms:ZANAMIVIR TFA
TypeSmall organic molecule
Emp. Form.C14H21F3N4O9
Mol. Mass.446.3331
SMILESOC(=O)C(F)(F)F.[H][C@]1(OC(=C[C@H](NC(N)=N)[C@H]1NC(C)=O)C(O)=O)[C@H](O)[C@H](O)CO