Reaction Details
TargetProthrombin
LigandBDBM50215447
Substrate/Competitorn/a
Meas. Tech.ChEMBL_209399 (CHEMBL811331)
Ki 2.9±n/a nM
Citation Cui, JJAraldi, GLReiner, JEReddy, KMKemp, SJHo, JZSiev, DVMamedova, LGibson, TSGaudette, JAMinami, NKAnderson, SMBradbury, AENolan, TGSemple, JE Non-covalent thrombin inhibitors featuring P3-heterocycles with P1-bicyclic arginine surrogates. Bioorg Med Chem Lett12:2925-30 (2002) Prothrombin
Name:Prothrombin
Type:Protein
Mol. Mass.:70029.57
Organism:Homo sapiens (Human)
Description:P00734
Residue:622
BDBM50215447
NameBDBM50215447
Synonyms:CHEMBL101867
TypeSmall organic molecule
Emp. Form.C25H26N6O3
Mol. Mass.458.5123
SMILESCc1cnc(NCCc2ccc3OCCc3c2)c(=O)n1CC(=O)NCc1ccc2[nH]ncc2c1