Reaction Details
TargetcAMP-specific 3',5'-cyclic phosphodiesterase 4C
LigandBDBM50219013
Substrate/Competitorn/a
Meas. Tech.ChEMBL_157225 (CHEMBL769549)
IC50 84±n/a nM
Citation Buckley, GMCooper, NDavenport, RJDyke, HJGalleway, FPGowers, LHaughan, AFKendall, HJLowe, CMontana, JGOxford, JPeake, JCPicken, CLRichard, MDSabin, VSharpe, AWarneck, JB 7-Methoxyfuro[2,3-c]pyridine-4-carboxamides as PDE4 inhibitors: a potential treatment for asthma. Bioorg Med Chem Lett12:509-12 (2002) cAMP-specific 3',5'-cyclic phosphodiesterase 4C
Name:cAMP-specific 3',5'-cyclic phosphodiesterase 4C
Type:PROTEIN
Mol. Mass.:60038.21
Organism:Rattus norvegicus
Description:ChEMBL_104732
Residue:536
BDBM50219013
NameBDBM50219013
Synonyms:CHEMBL343205
TypeSmall organic molecule
Emp. Form.C16H13Cl2N3O4
Mol. Mass.382.198
SMILESCCc1cc2c(cnc(OC)c2o1)C(=O)Nc1c(Cl)c[n+]([O-])cc1Cl