Reaction Details
TargetcAMP-specific 3',5'-cyclic phosphodiesterase 4C
LigandBDBM14361
Substrate/Competitorn/a
Meas. Tech.ChEMBL_157225 (CHEMBL769549)
IC50 20±n/a nM
Citation Buckley, GMCooper, NDavenport, RJDyke, HJGalleway, FPGowers, LHaughan, AFKendall, HJLowe, CMontana, JGOxford, JPeake, JCPicken, CLRichard, MDSabin, VSharpe, AWarneck, JB 7-Methoxyfuro[2,3-c]pyridine-4-carboxamides as PDE4 inhibitors: a potential treatment for asthma. Bioorg Med Chem Lett12:509-12 (2002) cAMP-specific 3',5'-cyclic phosphodiesterase 4C
Name:cAMP-specific 3',5'-cyclic phosphodiesterase 4C
Type:PROTEIN
Mol. Mass.:60038.21
Organism:Rattus norvegicus
Description:ChEMBL_104732
Residue:536
BDBM14361
NameBDBM14361
Synonyms:(R,S)-Rolipram 4-[3-(cyclopentyloxy)-4-methoxyphenyl]pyrrolidin-2-one CHEMBL63 | Rolipram
TypeSmall organic molecule
Emp. Form.C16H21NO3
Mol. Mass.275.3428
SMILESCOc1ccc(cc1OC1CCCC1)C1CNC(=O)C1