Reaction Details
TargetSodium channel protein type 1/2/3 subunit alpha
LigandBDBM50223734
Substrate/Competitorn/a
Meas. Tech.ChEMBL_202553 (CHEMBL804526)
IC50 28±n/a nM
Citation Liberatore, AMSchulz, JPommier, JBarthelemy, MAHuchet, MChabrier, PEBigg, D 2-Alkyl-4-arylimidazoles: structurally novel sodium channel modulators. Bioorg Med Chem Lett14:3521-3 (2004) Sodium channel protein type 1/2/3 subunit alpha
Name:Sodium channel protein type 1/2/3 subunit alpha
Type:n/a
Mol. Mass.:n/a
Description:ASSAY_ID of EBI is 202416
Components:This complex has 3 components.
Component 1
Name:Sodium channel protein type 1 subunit alpha
Synonyms:SCN1A_RAT Sodium (Site 1) Sodium channel protein type I alpha subunit Sodium channel protein, brain I subunit alpha Voltage-gated sodium channel subunit alpha Nav1.1
Type:PROTEIN
Mol. Mass.:228753.20
Organism:Rattus norvegicus
Description:ChEMBL_938840
Residue:2009
Component 2
Name:Sodium channel protein type 2 subunit alpha
Synonyms:SCN2A_RAT Scn2a1 Sodium channel protein type 2 subunit alpha Sodium channel protein type II subunit alpha Voltage-gated sodium channel | Voltage-gated sodium channel subunit alpha Nav1.2
Type:PROTEIN
Mol. Mass.:227854.11
Organism:Rattus norvegicus
Description:ChEMBL_1516893
Residue:2005
Component 3
Name:Sodium channel protein type 3 subunit alpha
Synonyms:SCN3A_RAT Sodium channel protein type 3 subunit alpha Sodium channel protein type III subunit alpha Voltage-gated sodium channel Voltage-gated sodium channel subunit alpha Nav1.3
Type:PROTEIN
Mol. Mass.:221371.72
Organism:Rattus norvegicus
Description:ChEMBL_1516894
Residue:1951
BDBM50223734
NameBDBM50223734
Synonyms:CHEMBL331942
TypeSmall organic molecule
Emp. Form.C19H28N2
Mol. Mass.284.439
SMILESCCCCCCc1nc(c[nH]1)-c1ccc(CC(C)C)cc1