Reaction Details
TargetProstacyclin receptor
LigandBDBM50223842
Substrate/Competitorn/a
Meas. Tech.ChEMBL_157784 (CHEMBL857865)
Ki 1259±n/a nM
Citation Clark, RDJahangir, ASeverance, DSalazar, RChang, TChang, DJett, MFSmith, SBley, K Discovery and SAR development of 2-(phenylamino) imidazolines as prostacyclin receptor antagonists [corrected]. Bioorg Med Chem Lett14:1053-6 (2004) Prostacyclin receptor
Name:Prostacyclin receptor
Type:G Protein-Coupled Receptor (GPCR)
Mol. Mass.:40968.22
Organism:Homo sapiens (Human)
Description:The membranes prepared from human platelet were used in binding assay.
Residue:386
BDBM50223842
NameBDBM50223842
Synonyms:CHEMBL9953
TypeSmall organic molecule
Emp. Form.C14H14N2OS
Mol. Mass.258.339
SMILESCOc1ccc(Sc2ccc(cc2)C(N)=N)cc1