Reaction Details
TargetD(1A)/D(1B)/D(2)/D(3)/D(4) dopamine receptor
LigandBDBM81993
Substrate/Competitorn/a
Meas. Tech.ChEMBL_59876 (CHEMBL673002)
IC50 28±n/a nM
Citation Jones, JHAnderson, PSBaldwin, JJClineschmidt, BVMcClure, DELundell, GFRandall, WCMartin, GEWilliams, MHirshfield, JM Synthesis of 4-substituted 2H-naphth[1,2-b]-1,4-oxazines, a new class of dopamine agonists. J Med Chem27:1607-13 (1984) D(1A)/D(1B)/D(2)/D(3)/D(4) dopamine receptor
Name:D(1A)/D(1B)/D(2)/D(3)/D(4) dopamine receptor
Synonyms:Dopamine receptor
Type:n/a
Mol. Mass.:n/a
Description:ASSAY_ID of ChEMBL is 60018
Components:This complex has 5 components.
Component 1
Name:D(2) dopamine receptor
Type:G Protein-Coupled Receptor (GPCR)
Mol. Mass.:50931.60
Organism:Rattus norvegicus (rat)
Description:P61169
Residue:444
Component 2
Name:D(1A) dopamine receptor
Synonyms:DOPAMINE D1 Dopamine D1 high Dopamine receptor Dopamine1-like Drd1a
Type:Enzyme Catalytic Domain
Mol. Mass.:49429.75
Organism:RAT
Description:P18901
Residue:446
Component 3
Name:D(3) dopamine receptor
Synonyms:DOPAMINE D3 Dopamine D3 receptor | Drd3
Type:Protein
Mol. Mass.:49540.58
Organism:Rattus norvegicus (Rat)
Description:P19020
Residue:446
Component 4
Name:D(4) dopamine receptor
Synonyms:D(4) dopamine receptor DOPAMINE D4.4 Dopamine receptor | Drd4
Type:Enzyme Catalytic Domain
Mol. Mass.:41307.65
Organism:RAT
Description:DOPAMINE D4.4 0 RAT::P30729
Residue:387
Component 5
Name:D(1B) dopamine receptor
Synonyms:D(1B) dopamine receptor DRD5_RAT Dopamine D5 receptor Drd5
Type:Enzyme Catalytic Domain
Mol. Mass.:52827.88
Organism:RAT
Description:Dopamine D1B 0 RAT::P25115
Residue:475
BDBM81993
NameBDBM81993
Synonyms:BROMOCRIPTINE Bromocriptine+ (GTP-)
Typen/a
Emp. Form.C32H40BrN5O5
Mol. Mass.654.594
SMILESCC(C)C[C@@H]1N2C(=O)[C@](NC(=O)[C@H]3CN(C)[C@@H]4Cc5c(Br)[nH]c6cccc(C4=C3)c56)(O[C@@]2(O)[C@@H]2CCCN2C1=O)C(C)C