Reaction Details
TargetCholesterol side-chain cleavage enzyme, mitochondrial
LigandBDBM50225950
Substrate/Competitorn/a
Meas. Tech.ChEMBL_206368 (CHEMBL813258)
IC50 125000±n/a nM
Citation Lejczak, BKafarski, PSztajer, HMastalerz, P Antibacterial activity of phosphono dipeptides related to alafosfalin. J Med Chem29:2212-7 (1986) Cholesterol side-chain cleavage enzyme, mitochondrial
Name:Cholesterol side-chain cleavage enzyme, mitochondrial
Type:PROTEIN
Mol. Mass.:60603.33
Organism:Rattus norvegicus
Description:ChEMBL_50353
Residue:526
BDBM50225950
NameBDBM50225950
Synonyms:CHEMBL420005
TypeSmall organic molecule
Emp. Form.C7H15N2O6P
Mol. Mass.254.1776
SMILESCC(N)C(=O)NC(CCC(O)=O)P(O)(O)=O