Reaction Details
TargetCholesterol side-chain cleavage enzyme, mitochondrial
LigandBDBM50225967
Substrate/Competitorn/a
Meas. Tech.ChEMBL_206368 (CHEMBL813258)
IC50 63900±n/a nM
Citation Lejczak, BKafarski, PSztajer, HMastalerz, P Antibacterial activity of phosphono dipeptides related to alafosfalin. J Med Chem29:2212-7 (1986) Cholesterol side-chain cleavage enzyme, mitochondrial
Name:Cholesterol side-chain cleavage enzyme, mitochondrial
Type:PROTEIN
Mol. Mass.:60603.33
Organism:Rattus norvegicus
Description:ChEMBL_50353
Residue:526
BDBM50225967
NameBDBM50225967
Synonyms:CHEMBL71582
TypeSmall organic molecule
Emp. Form.C9H19N2O4P
Mol. Mass.250.2319
SMILESCC(N)C(=O)NC(C1CCCC1)P(O)(O)=O