Reaction Details
TargetCholesterol side-chain cleavage enzyme, mitochondrial
LigandBDBM50225970
Substrate/Competitorn/a
Meas. Tech.ChEMBL_206368 (CHEMBL813258)
IC50 90400±n/a nM
Citation Lejczak, BKafarski, PSztajer, HMastalerz, P Antibacterial activity of phosphono dipeptides related to alafosfalin. J Med Chem29:2212-7 (1986) Cholesterol side-chain cleavage enzyme, mitochondrial
Name:Cholesterol side-chain cleavage enzyme, mitochondrial
Type:PROTEIN
Mol. Mass.:60603.33
Organism:Rattus norvegicus
Description:ChEMBL_50353
Residue:526
BDBM50225970
NameBDBM50225970
Synonyms:CHEMBL71637
TypeSmall organic molecule
Emp. Form.C6H15N2O4P
Mol. Mass.210.1681
SMILESCC(N)C(=O)NC(C)(C)P(O)(O)=O