Reaction Details
TargetCholesterol side-chain cleavage enzyme, mitochondrial
LigandBDBM50225972
Substrate/Competitorn/a
Meas. Tech.ChEMBL_206368 (CHEMBL813258)
IC50 152000±n/a nM
Citation Lejczak, BKafarski, PSztajer, HMastalerz, P Antibacterial activity of phosphono dipeptides related to alafosfalin. J Med Chem29:2212-7 (1986) Cholesterol side-chain cleavage enzyme, mitochondrial
Name:Cholesterol side-chain cleavage enzyme, mitochondrial
Type:PROTEIN
Mol. Mass.:60603.33
Organism:Rattus norvegicus
Description:ChEMBL_50353
Residue:526
BDBM50225972
NameBDBM50225972
Synonyms:CHEMBL70855
TypeSmall organic molecule
Emp. Form.C5H13N2O4P
Mol. Mass.196.1415
SMILESCC(N)C(=O)NC(C)P(O)(O)=O