Reaction Details
TargetAlpha-2A adrenergic receptor [16-465]/Alpha-2B adrenergic receptor/Alpha-2C adrenergic receptor
LigandBDBM50226929
Substrate/Competitorn/a
Meas. Tech.ChEMBL_216139 (CHEMBL816957)
Ki 12±n/a nM
Citation Wentland, MPBailey, DMAlexander, EJCastaldi, MJFerrari, RAHaubrich, DRLuttinger, DAPerrone, MH Synthesis and antidepressant properties of novel 2-substituted 4,5-dihydro-1H-imidazole derivatives. J Med Chem30:1482-9 (1987) Alpha-2A adrenergic receptor [16-465]/Alpha-2B adrenergic receptor/Alpha-2C adrenergic receptor
Name:Alpha-2A adrenergic receptor [16-465]/Alpha-2B adrenergic receptor/Alpha-2C adrenergic receptor
Synonyms:Adrenergic receptor alpha-2
Type:n/a
Mol. Mass.:n/a
Description:ASSAY_ID of ChEMBL is 935397
Components:This complex has 3 components.
Component 1
Name:Alpha-2C adrenergic receptor
Type:Enzyme Catalytic Domain
Mol. Mass.:49890.50
Organism:RAT
Description:adrenergic Alpha2 0 RAT::P22086
Residue:458
Component 2
Name:Alpha-2B adrenergic receptor
Synonyms:ADA2B_RAT Adrenergic receptor alpha Alpha-2B adrenergic receptor Alpha-2B adrenoreceptor | adrenergic Alpha2B
Type:Enzyme Catalytic Domain
Mol. Mass.:50379.83
Organism:NEONATAL RAT
Description:adrenergic Alpha2B ADRA2B NEONATAL RAT::P19328
Residue:453
Component 3
Name:Alpha-2A adrenergic receptor [16-465]
Synonyms:ADA2A_RAT Adrenaline 2 Alpha-2A adrenoceptor Alpha-2AAR Alpha2 Adrenoreceptor adrenergic Alpha2A
Type:G-protein coupled receptor
Mol. Mass.:48961.69
Organism:Rattus norvegicus (rat)
Description:P22909[16-465]
Residue:450
BDBM50226929
NameBDBM50226929
Synonyms:CHEMBL545646
TypeSmall organic molecule
Emp. Form.C15H19ClN2
Mol. Mass.262.778
SMILESCl.CC1=C(CC2=NCCN2)CCc2ccccc12