Reaction Details
TargetAlpha-1A/Alpha-1B/Alpha-1D adrenergic receptor
LigandBDBM50227291
Substrate/Competitorn/a
Meas. Tech.ChEMBL_34432 (CHEMBL649435)
Ki 1.0±n/a nM
Citation Campbell, SFDanilewicz, JCGreengrass, CWPlews, RM 2,4-Diamino-6,7-dimethoxyquinazolines. 4. 2-[4-(substituted oxyethoxy) piperidino] derivatives as alpha 1-adrenoceptor antagonists and antihypertensive agents. J Med Chem31:516-20 (1988) Alpha-1A/Alpha-1B/Alpha-1D adrenergic receptor
Name:Alpha-1A/Alpha-1B/Alpha-1D adrenergic receptor
Type:n/a
Mol. Mass.:n/a
Description:ASSAY_ID of EBI is 303470
Components:This complex has 3 components.
Component 1
Name:Alpha-1B adrenergic receptor
Synonyms:ADA1B_RAT Alpha 1B-adrenoceptor Alpha adrenergic receptor 1A and 1B Alpha-1Adrenoceptor Alpha-1B adrenoreceptor | adrenergic Alpha1B
Type:G Protein-Coupled Receptor (GPCR)
Mol. Mass.:56606.71
Organism:Rattus norvegicus (rat)
Description:Receptor binding assays were performed using rat cortical membranes.
Residue:515
Component 2
Name:Alpha-1A adrenergic receptor
Synonyms:ADA1A_RAT Adra1c Alpha-1A adrenoceptor Alpha-1C adrenergic receptor | adrenergic Alpha1A
Type:Protein
Mol. Mass.:51620.15
Organism:Rattus norvegicus (Rat)
Description:P43140
Residue:466
Component 3
Name:Alpha-1D adrenergic receptor
Synonyms:ADA1D_RAT Adra1d Alpha-1D adrenergic receptor | Serotonin 1a (5-HT1a) receptor/Adrenergic receptor alpha-1
Type:Protein
Mol. Mass.:59375.97
Organism:Rattus norvegicus (Rat)
Description:P23944
Residue:561
BDBM50227291
NameBDBM50227291
Synonyms:CHEMBL149828
TypeSmall organic molecule
Emp. Form.C21H32N4O4
Mol. Mass.404.5032
SMILESCCCCOCCOC1CCN(CC1)c1nc(N)c2cc(OC)c(OC)cc2n1