Reaction Details
TargetD(2) dopamine receptor
LigandBDBM50228323
Substrate/Competitorn/a
Meas. Tech.ChEMBL_61145 (CHEMBL670682)
Ki 1820±n/a nM
Citation Charifson, PSBowen, JPWyrick, SDHoffman, AJCory, MMcPhail, ATMailman, RB Conformational analysis and molecular modeling of 1-phenyl-, 4-phenyl-, and 1-benzyl-1,2,3,4-tetrahydroisoquinolines as D1 dopamine receptor ligands. J Med Chem32:2050-8 (1989) D(2) dopamine receptor
Name:D(2) dopamine receptor
Type:Cell-surface receptors
Mol. Mass.:50647.10
Organism:Homo sapiens (Human)
Description:P14416
Residue:443
BDBM50228323
NameBDBM50228323
Synonyms:CHEMBL59603
TypeSmall organic molecule
Emp. Form.C15H14ClNO
Mol. Mass.259.731
SMILESOc1cc2[C@@H](CNCc2cc1Cl)c1ccccc1