Reaction Details
Target5-hydroxytryptamine receptor 1A
LigandBDBM10755
Substrate/Competitorn/a
Meas. Tech.ChEMBL_1556 (CHEMBL616377)
Kd 3.2±n/a nM
Citation King, FDBrown, AMGaster, LMKaumann, AJMedhurst, ADParker, SGParsons, AAPatch, TLRaval, P (+/-) 3-Amino-6-carboxamido-1,2,3,4-tetrahydrocarbazole: a conformationally restricted analogue of 5-carboxamidotryptamine with selectivity for the serotonin 5-HT1D receptor. J Med Chem36:1918-9 (1993) 
 
5-hydroxytryptamine receptor 1A
Name:5-hydroxytryptamine receptor 1A
Type:n/a
Mol. Mass.:46122.49
Organism:Homo sapiens (Human)
Description:n/a
Residue:422
BDBM10755
NameBDBM10755
Synonyms:14C-5-hydroxy tryptamine creatinine disulfate 5-HT 5-hydroxy tryptamine creatinine disulfate Serotonin | [3H]-5-HT
TypeSmall organic molecule
Emp. Form.C10H12N2O
Mol. Mass.176.2151
SMILESNCCc1c[nH]c2ccc(O)cc12