Reaction Details
TargetReceptor-interacting serine/threonine-protein kinase 1
LigandBDBM50229429
Substrate/Competitorn/a
Meas. Tech.ChEBML_1644186
EC50 656±n/a nM
Citation Ren, YSu, YSun, LHe, SMeng, LLiao, DLiu, XMa, YLiu, CLi, SRuan, HLei, XWang, XZhang, Z Discovery of a Highly Potent, Selective, and Metabolically Stable Inhibitor of Receptor-Interacting Protein 1 (RIP1) for the Treatment of Systemic Inflammatory Response Syndrome. J Med Chem60:972-986 (2017) 
 
Receptor-interacting serine/threonine-protein kinase 1
Name:Receptor-interacting serine/threonine-protein kinase 1
Type:Enzyme Catalytic Domain
Mol. Mass.:75926.99
Organism:Homo sapiens (Human)
Description:Q13546
Residue:671
BDBM50229429
NameBDBM50229429
Synonyms:CHEMBL4092663
TypeSmall organic molecule
Emp. Form.C14H13F6NO
Mol. Mass.325.2495
SMILESCN(Cc1cc(F)cc(F)c1F)C(=O)C1(CCC1)C(F)(F)F