Reaction Details
TargetReceptor-interacting serine/threonine-protein kinase 1
LigandBDBM50229586
Substrate/Competitorn/a
Meas. Tech.ChEBML_1644186
EC50 627±n/a nM
Citation Ren, YSu, YSun, LHe, SMeng, LLiao, DLiu, XMa, YLiu, CLi, SRuan, HLei, XWang, XZhang, Z Discovery of a Highly Potent, Selective, and Metabolically Stable Inhibitor of Receptor-Interacting Protein 1 (RIP1) for the Treatment of Systemic Inflammatory Response Syndrome. J Med Chem60:972-986 (2017) 
 
Receptor-interacting serine/threonine-protein kinase 1
Name:Receptor-interacting serine/threonine-protein kinase 1
Type:Enzyme Catalytic Domain
Mol. Mass.:75926.99
Organism:Homo sapiens (Human)
Description:Q13546
Residue:671
BDBM50229586
NameBDBM50229586
Synonyms:CHEMBL4087013
TypeSmall organic molecule
Emp. Form.C14H19F2NO
Mol. Mass.255.3036
SMILESCCC(C)(C)C(=O)N(C)Cc1ccc(F)cc1F