Reaction Details
TargetReceptor-interacting serine/threonine-protein kinase 1
LigandBDBM50229610
Substrate/Competitorn/a
Meas. Tech.ChEBML_1644186
EC50 1308±n/a nM
Citation Ren, YSu, YSun, LHe, SMeng, LLiao, DLiu, XMa, YLiu, CLi, SRuan, HLei, XWang, XZhang, Z Discovery of a Highly Potent, Selective, and Metabolically Stable Inhibitor of Receptor-Interacting Protein 1 (RIP1) for the Treatment of Systemic Inflammatory Response Syndrome. J Med Chem60:972-986 (2017) 
 
Receptor-interacting serine/threonine-protein kinase 1
Name:Receptor-interacting serine/threonine-protein kinase 1
Type:Enzyme Catalytic Domain
Mol. Mass.:75926.99
Organism:Homo sapiens (Human)
Description:Q13546
Residue:671
BDBM50229610
NameBDBM50229610
Synonyms:CHEMBL4073983
TypeSmall organic molecule
Emp. Form.C14H23NOS
Mol. Mass.253.404
SMILESCCC(C)(C)C(=O)N(C)Cc1cc(C)c(C)s1