Reaction Details
TargetPoly [ADP-ribose] polymerase tankyrase-2
LigandBDBM50229710
Substrate/Competitorn/a
Meas. Tech.ChEMBL_1644275 (CHEMBL3993204)
IC50 316±n/a nM
Citation Hu, YStumpfe, DBajorath, J Recent Advances in Scaffold Hopping. J Med Chem60:1238-1246 (2017) 
 
Poly [ADP-ribose] polymerase tankyrase-2
Name:Poly [ADP-ribose] polymerase tankyrase-2
Type:Enzyme
Mol. Mass.:126937.16
Organism:Homo sapiens (Human)
Description:Q9H2K2
Residue:1166
BDBM50229710
NameBDBM50229710
Synonyms:CHEMBL4076784
TypeSmall organic molecule
Emp. Form.C14H24N4S
Mol. Mass.280.432
SMILESC(CCC1CCCCC1)CNc1nnc2SCCn12