Reaction Details
TargetAngiopoietin-1 receptor
LigandBDBM50230178
Substrate/Competitorn/a
Meas. Tech.ChEMBL_1644611 (CHEMBL3993540)
IC50 0.130000±n/a nM
Citation Zhang, LShan, YLi, CSun, YSu, PWang, JLi, LPan, XZhang, J Discovery of novel anti-angiogenesis agents. Part 6: Multi-targeted RTK inhibitors. Eur J Med Chem127:275-285 (2017) 
 
Angiopoietin-1 receptor
Name:Angiopoietin-1 receptor
Type:Enzyme
Mol. Mass.:125835.70
Organism:Homo sapiens (Human)
Description:Q02763
Residue:1124
BDBM50230178
NameBDBM50230178
Synonyms:CHEMBL4087541
TypeSmall organic molecule
Emp. Form.C22H17N5O2S
Mol. Mass.415.468
SMILESNc1ncc2ccc(cc2n1)-c1ccc(NC(=S)Nc2ccc3OCOc3c2)cc1