Reaction Details
TargetCarbonic anhydrase 1
LigandBDBM50230197
Substrate/Competitorn/a
Meas. Tech.ChEMBL_1644695 (CHEMBL3993624)
Ki>100±n/a nM
Citation Bua, SDi Cesare Mannelli, LVullo, DGhelardini, CBartolucci, GScozzafava, ASupuran, CTCarta, F Design and Synthesis of Novel Nonsteroidal Anti-Inflammatory Drugs and Carbonic Anhydrase Inhibitors Hybrids (NSAIDs-CAIs) for the Treatment of Rheumatoid Arthritis. J Med Chem60:1159-1170 (2017) 
 
Carbonic anhydrase 1
Name:Carbonic anhydrase 1
Type:Enzyme
Mol. Mass.:28873.37
Organism:Homo sapiens (Human)
Description:P00915
Residue:261
BDBM50230197
NameBDBM50230197
Synonyms:CHEMBL4060402
TypeSmall organic molecule
Emp. Form.C26H22N2O5
Mol. Mass.442.4633
SMILESO=C(NCCOc1ccc2oc(=O)ccc2c1)C1CCn2c1ccc2C(=O)c1ccccc1