Reaction Details
TargetCarbonic anhydrase 1
LigandBDBM50230199
Substrate/Competitorn/a
Meas. Tech.ChEMBL_1644695 (CHEMBL3993624)
Ki>100±n/a nM
Citation Bua, SDi Cesare Mannelli, LVullo, DGhelardini, CBartolucci, GScozzafava, ASupuran, CTCarta, F Design and Synthesis of Novel Nonsteroidal Anti-Inflammatory Drugs and Carbonic Anhydrase Inhibitors Hybrids (NSAIDs-CAIs) for the Treatment of Rheumatoid Arthritis. J Med Chem60:1159-1170 (2017) 
 
Carbonic anhydrase 1
Name:Carbonic anhydrase 1
Type:Enzyme
Mol. Mass.:28873.37
Organism:Homo sapiens (Human)
Description:P00915
Residue:261
BDBM50230199
NameBDBM50230199
Synonyms:CHEMBL4076291
TypeSmall organic molecule
Emp. Form.C31H26FNO5S
Mol. Mass.543.605
SMILESC[S+]([O-])c1ccc(\C=C2\C(C)=C(CC(=O)NCCOc3ccc4ccc(=O)oc4c3)c3cc(F)ccc23)cc1