Reaction Details
TargetCarbonic anhydrase 2
LigandBDBM50230200
Substrate/Competitorn/a
Meas. Tech.ChEMBL_1644696 (CHEMBL3993625)
Ki 85±n/a nM
Citation Bua, SDi Cesare Mannelli, LVullo, DGhelardini, CBartolucci, GScozzafava, ASupuran, CTCarta, F Design and Synthesis of Novel Nonsteroidal Anti-Inflammatory Drugs and Carbonic Anhydrase Inhibitors Hybrids (NSAIDs-CAIs) for the Treatment of Rheumatoid Arthritis. J Med Chem60:1159-1170 (2017) 
 
Carbonic anhydrase 2
Name:Carbonic anhydrase 2
Type:Enzyme
Mol. Mass.:29250.71
Organism:Homo sapiens (Human)
Description:P00918
Residue:260
BDBM50230200
NameBDBM50230200
Synonyms:CHEMBL4079848
TypeSmall organic molecule
Emp. Form.C27H23NO5
Mol. Mass.441.4752
SMILESCC(C(=O)NCCOc1ccc2ccc(=O)oc2c1)c1cccc(c1)C(=O)c1ccccc1