Reaction Details
TargetCarbonic anhydrase 4
LigandBDBM50230194
Substrate/Competitorn/a
Meas. Tech.ChEMBL_1644697 (CHEMBL3993626)
Ki 4.4±n/a nM
Citation Bua, SDi Cesare Mannelli, LVullo, DGhelardini, CBartolucci, GScozzafava, ASupuran, CTCarta, F Design and Synthesis of Novel Nonsteroidal Anti-Inflammatory Drugs and Carbonic Anhydrase Inhibitors Hybrids (NSAIDs-CAIs) for the Treatment of Rheumatoid Arthritis. J Med Chem60:1159-1170 (2017) 
 
Carbonic anhydrase 4
Name:Carbonic anhydrase 4
Type:Enzyme
Mol. Mass.:35037.98
Organism:Homo sapiens (Human)
Description:P22748
Residue:312
BDBM50230194
NameBDBM50230194
Synonyms:CHEMBL4082922
TypeSmall organic molecule
Emp. Form.C27H23NO5
Mol. Mass.441.4752
SMILESCC(C(=O)NCCOc1ccc2oc(=O)ccc2c1)c1cccc(c1)C(=O)c1ccccc1