Reaction Details
TargetCarbonic anhydrase 4
LigandBDBM50230203
Substrate/Competitorn/a
Meas. Tech.ChEMBL_1644697 (CHEMBL3993626)
Ki 9.8±n/a nM
Citation Bua, SDi Cesare Mannelli, LVullo, DGhelardini, CBartolucci, GScozzafava, ASupuran, CTCarta, F Design and Synthesis of Novel Nonsteroidal Anti-Inflammatory Drugs and Carbonic Anhydrase Inhibitors Hybrids (NSAIDs-CAIs) for the Treatment of Rheumatoid Arthritis. J Med Chem60:1159-1170 (2017) 
 
Carbonic anhydrase 4
Name:Carbonic anhydrase 4
Type:Enzyme
Mol. Mass.:35037.98
Organism:Homo sapiens (Human)
Description:P22748
Residue:312
BDBM50230203
NameBDBM50230203
Synonyms:CHEMBL4067437
TypeSmall organic molecule
Emp. Form.C25H23NO5
Mol. Mass.417.4538
SMILESCOc1ccc2cc(ccc2c1)[C@H](C)C(=O)NCCOc1ccc2ccc(=O)oc2c1