Reaction Details
TargetCarbonic anhydrase 7
LigandBDBM50230196
Substrate/Competitorn/a
Meas. Tech.ChEMBL_1644698 (CHEMBL3993627)
Ki>100±n/a nM
Citation Bua, SDi Cesare Mannelli, LVullo, DGhelardini, CBartolucci, GScozzafava, ASupuran, CTCarta, F Design and Synthesis of Novel Nonsteroidal Anti-Inflammatory Drugs and Carbonic Anhydrase Inhibitors Hybrids (NSAIDs-CAIs) for the Treatment of Rheumatoid Arthritis. J Med Chem60:1159-1170 (2017) 
 
Carbonic anhydrase 7
Name:Carbonic anhydrase 7
Type:Enzyme
Mol. Mass.:29664.11
Organism:Homo sapiens (Human)
Description:Human cloned isozyme.
Residue:264
BDBM50230196
NameBDBM50230196
Synonyms:CHEMBL4096350
TypeSmall organic molecule
Emp. Form.C26H22FNO4
Mol. Mass.431.4556
SMILESCC(C(=O)NCCOc1ccc2oc(=O)ccc2c1)c1ccc(c(F)c1)-c1ccccc1