Reaction Details
TargetCarbonic anhydrase 12
LigandBDBM50230207
Substrate/Competitorn/a
Meas. Tech.ChEMBL_1644700 (CHEMBL3993629)
Ki 93±n/a nM
Citation Bua, SDi Cesare Mannelli, LVullo, DGhelardini, CBartolucci, GScozzafava, ASupuran, CTCarta, F Design and Synthesis of Novel Nonsteroidal Anti-Inflammatory Drugs and Carbonic Anhydrase Inhibitors Hybrids (NSAIDs-CAIs) for the Treatment of Rheumatoid Arthritis. J Med Chem60:1159-1170 (2017) 
 
Carbonic anhydrase 12
Name:Carbonic anhydrase 12
Type:Enzyme
Mol. Mass.:39456.00
Organism:Homo sapiens (Human)
Description:Catalytic domain of human cloned isozyme was used in the assay
Residue:354
BDBM50230207
NameBDBM50230207
Synonyms:CHEMBL4069089
TypeSmall organic molecule
Emp. Form.C25H20Cl2N2O4
Mol. Mass.483.343
SMILESClc1cccc(Cl)c1Nc1ccccc1CC(=O)NCCOc1ccc2oc(=O)ccc2c1