Reaction Details
TargetCarbonic anhydrase 9
LigandBDBM50230193
Substrate/Competitorn/a
Meas. Tech.ChEMBL_1644699 (CHEMBL3993628)
Ki 31±n/a nM
Citation Bua, SDi Cesare Mannelli, LVullo, DGhelardini, CBartolucci, GScozzafava, ASupuran, CTCarta, F Design and Synthesis of Novel Nonsteroidal Anti-Inflammatory Drugs and Carbonic Anhydrase Inhibitors Hybrids (NSAIDs-CAIs) for the Treatment of Rheumatoid Arthritis. J Med Chem60:1159-1170 (2017) 
 
Carbonic anhydrase 9
Name:Carbonic anhydrase 9
Type:Enzyme
Mol. Mass.:49669.03
Organism:Homo sapiens (Human)
Description:Catalytic domain of human cloned isozyme was used in the assay
Residue:459
BDBM50230193
NameBDBM50230193
Synonyms:CHEMBL4097542
TypeSmall organic molecule
Emp. Form.C31H26FNO5S
Mol. Mass.543.605
SMILESC[S+]([O-])c1ccc(\C=C2\C(C)=C(CC(=O)NCCOc3ccc4oc(=O)ccc4c3)c3cc(F)ccc23)cc1