Reaction Details
TargetCarbonic anhydrase 12
LigandBDBM50230197
Substrate/Competitorn/a
Meas. Tech.ChEMBL_1644700 (CHEMBL3993629)
Ki>100±n/a nM
Citation Bua, SDi Cesare Mannelli, LVullo, DGhelardini, CBartolucci, GScozzafava, ASupuran, CTCarta, F Design and Synthesis of Novel Nonsteroidal Anti-Inflammatory Drugs and Carbonic Anhydrase Inhibitors Hybrids (NSAIDs-CAIs) for the Treatment of Rheumatoid Arthritis. J Med Chem60:1159-1170 (2017) 
 
Carbonic anhydrase 12
Name:Carbonic anhydrase 12
Type:Enzyme
Mol. Mass.:39456.00
Organism:Homo sapiens (Human)
Description:Catalytic domain of human cloned isozyme was used in the assay
Residue:354
BDBM50230197
NameBDBM50230197
Synonyms:CHEMBL4060402
TypeSmall organic molecule
Emp. Form.C26H22N2O5
Mol. Mass.442.4633
SMILESO=C(NCCOc1ccc2oc(=O)ccc2c1)C1CCn2c1ccc2C(=O)c1ccccc1