Reaction Details
TargetAdenosine receptor A1
LigandBDBM50231707
Substrate/Competitorn/a
Meas. Tech.ChEMBL_1645467 (CHEMBL3994396)
Ki 5.6±n/a nM
Citation Koul, SRamdas, VBarawkar, DAWaman, YBPrasad, NMadadi, SKShejul, YDBonagiri, RBasu, SMenon, SReddy, SBChaturvedi, SChennamaneni, SRBedse, GThakare, RGundu, JChaudhary, SDe, SMeru, AVPalle, VChugh, AMookhtiar, KA Design and synthesis of novel, potent and selective hypoxanthine analogs as adenosine A Bioorg Med Chem25:1963-1975 (2017) 
 
Adenosine receptor A1
Name:Adenosine receptor A1
Type:G Protein-Coupled Receptor (GPCR)
Mol. Mass.:36520.92
Organism:Homo sapiens (Human)
Description:P30542
Residue:326
BDBM50231707
NameBDBM50231707
Synonyms:CHEMBL4085564
TypeSmall organic molecule
Emp. Form.C21H23N5O2
Mol. Mass.377.4396
SMILESCCCn1c(Oc2cccc3cc[nH]c23)nc2nc([nH]c2c1=O)C1CCCC1