Reaction Details
TargetAdenosine receptor A1
LigandBDBM50231593
Substrate/Competitorn/a
Meas. Tech.ChEMBL_1645459 (CHEMBL3994388)
Ki 57±n/a nM
Citation Koul, SRamdas, VBarawkar, DAWaman, YBPrasad, NMadadi, SKShejul, YDBonagiri, RBasu, SMenon, SReddy, SBChaturvedi, SChennamaneni, SRBedse, GThakare, RGundu, JChaudhary, SDe, SMeru, AVPalle, VChugh, AMookhtiar, KA Design and synthesis of novel, potent and selective hypoxanthine analogs as adenosine A Bioorg Med Chem25:1963-1975 (2017) 
 
Adenosine receptor A1
Name:Adenosine receptor A1
Type:G Protein-Coupled Receptor (GPCR)
Mol. Mass.:36520.92
Organism:Homo sapiens (Human)
Description:P30542
Residue:326
BDBM50231593
NameBDBM50231593
Synonyms:CHEMBL4068469
TypeSmall organic molecule
Emp. Form.C18H26N4O3
Mol. Mass.346.424
SMILESCCCn1c(OC2CCC(O)C2)nc2nc([nH]c2c1=O)C1CCCC1