Reaction Details
TargetAdenosine receptor A1
LigandBDBM50231718
Substrate/Competitorn/a
Meas. Tech.ChEMBL_1645459 (CHEMBL3994388)
Ki 27±n/a nM
Citation Koul, SRamdas, VBarawkar, DAWaman, YBPrasad, NMadadi, SKShejul, YDBonagiri, RBasu, SMenon, SReddy, SBChaturvedi, SChennamaneni, SRBedse, GThakare, RGundu, JChaudhary, SDe, SMeru, AVPalle, VChugh, AMookhtiar, KA Design and synthesis of novel, potent and selective hypoxanthine analogs as adenosine A Bioorg Med Chem25:1963-1975 (2017) 
 
Adenosine receptor A1
Name:Adenosine receptor A1
Type:G Protein-Coupled Receptor (GPCR)
Mol. Mass.:36520.92
Organism:Homo sapiens (Human)
Description:P30542
Residue:326
BDBM50231718
NameBDBM50231718
Synonyms:CHEMBL4073565
TypeSmall organic molecule
Emp. Form.C21H27N5O
Mol. Mass.365.472
SMILESCCCn1c(NCc2ccc(C)cc2)nc2nc([nH]c2c1=O)C1CCCC1