Reaction Details
TargetHistone deacetylase 2
LigandBDBM50439674
Substrate/Competitorn/a
Meas. Tech.ChEMBL_1646424 (CHEMBL3995480)
IC50 48±n/a nM
Citation Nepali, KLee, HYLai, MJOjha, RWu, TYWu, GXChen, MCLiou, JP Ring-opened tetrahydro-¿-carbolines display cytotoxicity and selectivity with histone deacetylase isoforms. Eur J Med Chem127:115-127 (2017) 
 
Histone deacetylase 2
Name:Histone deacetylase 2
Type:Chromatin regulator; hydrolase; repressor
Mol. Mass.:55356.54
Organism:Homo sapiens (Human)
Description:Q92769
Residue:488
BDBM50439674
NameBDBM50439674
Synonyms:RICOLINOSTAT US11207431, Example E US8609678, 2-(diphenylamino)-N-(7-(hydroxyamino)-7-oxoheptyl)pyrimidine-5-carboxamide [26]
TypeSmall organic molecule
Emp. Form.C24H27N5O3
Mol. Mass.433.5029
SMILESONC(=O)CCCCCCNC(=O)c1cnc(nc1)N(c1ccccc1)c1ccccc1