Reaction Details
TargetHistone deacetylase 2
LigandBDBM50232362
Substrate/Competitorn/a
Meas. Tech.ChEMBL_1646419 (CHEMBL3995475)
IC50 2380±n/a nM
Citation Nepali, KLee, HYLai, MJOjha, RWu, TYWu, GXChen, MCLiou, JP Ring-opened tetrahydro-¿-carbolines display cytotoxicity and selectivity with histone deacetylase isoforms. Eur J Med Chem127:115-127 (2017) 
 
Histone deacetylase 2
Name:Histone deacetylase 2
Type:Chromatin regulator; hydrolase; repressor
Mol. Mass.:55356.54
Organism:Homo sapiens (Human)
Description:Q92769
Residue:488
BDBM50232362
NameBDBM50232362
Synonyms:CHEMBL4079799
TypeSmall organic molecule
Emp. Form.C22H25N3O2
Mol. Mass.363.4528
SMILESCN(C)Cc1c(C)n(Cc2ccc(\C=C\C(=O)NO)cc2)c2ccccc12