Reaction Details
TargetHistone deacetylase 6
LigandBDBM50232363
Substrate/Competitorn/a
Meas. Tech.ChEMBL_1646420 (CHEMBL3995476)
IC50 43.1±n/a nM
Citation Nepali, KLee, HYLai, MJOjha, RWu, TYWu, GXChen, MCLiou, JP Ring-opened tetrahydro-¿-carbolines display cytotoxicity and selectivity with histone deacetylase isoforms. Eur J Med Chem127:115-127 (2017) 
 
Histone deacetylase 6
Name:Histone deacetylase 6
Type:Chromatin regulator; hydrolase; repressor
Mol. Mass.:131381.51
Organism:Homo sapiens (Human)
Description:Q9UBN7
Residue:1215
BDBM50232363
NameBDBM50232363
Synonyms:CHEMBL4102147
TypeSmall organic molecule
Emp. Form.C21H23N3O2
Mol. Mass.349.4262
SMILESCN(C)Cc1cn(Cc2ccc(\C=C\C(=O)NO)cc2)c2ccccc12