Reaction Details
TargetHistone deacetylase 1
LigandBDBM50232362
Substrate/Competitorn/a
Meas. Tech.ChEMBL_1646418 (CHEMBL3995474)
IC50 2130±n/a nM
Citation Nepali, KLee, HYLai, MJOjha, RWu, TYWu, GXChen, MCLiou, JP Ring-opened tetrahydro-¿-carbolines display cytotoxicity and selectivity with histone deacetylase isoforms. Eur J Med Chem127:115-127 (2017) 
 
Histone deacetylase 1
Name:Histone deacetylase 1
Type:Enzyme
Mol. Mass.:55090.27
Organism:Homo sapiens (Human)
Description:Q13547
Residue:482
BDBM50232362
NameBDBM50232362
Synonyms:CHEMBL4079799
TypeSmall organic molecule
Emp. Form.C22H25N3O2
Mol. Mass.363.4528
SMILESCN(C)Cc1c(C)n(Cc2ccc(\C=C\C(=O)NO)cc2)c2ccccc12