Reaction Details
TargetMetabotropic glutamate receptor 5
LigandBDBM50232461
Substrate/Competitorn/a
Meas. Tech.ChEMBL_1647822 (CHEMBL3996878)
IC50 4920±n/a nM
Citation Gómez-Santacana, XDalton, JARRovira, XPin, JPGoudet, CGorostiza, PGiraldo, JLlebaria, A Positional isomers of bispyridine benzene derivatives induce efficacy changes on mGlu Eur J Med Chem127:567-576 (2017) 
 
Metabotropic glutamate receptor 5
Name:Metabotropic glutamate receptor 5
Type:Enzyme
Mol. Mass.:131900.14
Organism:Rattus norvegicus (Rat)
Description:P31424
Residue:1203
BDBM50232461
NameBDBM50232461
Synonyms:CHEMBL4083861
TypeSmall organic molecule
Emp. Form.C16H12N6
Mol. Mass.288.3067
SMILESc1ccc(\N=N\c2cccc(c2)\N=N\c2ccccn2)nc1