Reaction Details
TargetMetabotropic glutamate receptor 5
LigandBDBM50179663
Substrate/Competitorn/a
Meas. Tech.ChEMBL_1647822 (CHEMBL3996878)
IC50 2300±n/a nM
Citation Gómez-Santacana, XDalton, JARRovira, XPin, JPGoudet, CGorostiza, PGiraldo, JLlebaria, A Positional isomers of bispyridine benzene derivatives induce efficacy changes on mGlu Eur J Med Chem127:567-576 (2017) 
 
Metabotropic glutamate receptor 5
Name:Metabotropic glutamate receptor 5
Type:Enzyme
Mol. Mass.:131900.14
Organism:Rattus norvegicus (Rat)
Description:P31424
Residue:1203
BDBM50179663
NameBDBM50179663
Synonyms:1-(3-chlorophenyl)-3-(1-methyl-5-oxoimidazolidin-2-ylidene)urea | CHEMBL204115
TypeSmall organic molecule
Emp. Form.C11H11ClN4O2
Mol. Mass.266.684
SMILESCn1c(O)cnc1NC(=O)Nc1cccc(Cl)c1