Reaction Details
TargetProstaglandin E2 receptor EP2 subtype
LigandBDBM50107283
Substrate/Competitorn/a
Meas. Tech.ChEBML_1648060
Ki>5000±n/a nM
Citation Okumura, YYamagishi, TNukui, SNakao, K Discovery of AAT-008, a novel, potent, and selective prostaglandin EP4 receptor antagonist. Bioorg Med Chem Lett27:1186-1192 (2017) 
 
Prostaglandin E2 receptor EP2 subtype
Name:Prostaglandin E2 receptor EP2 subtype
Type:Enzyme
Mol. Mass.:39775.71
Organism:Homo sapiens (Human)
Description:P43116
Residue:358
BDBM50107283
NameBDBM50107283
Synonyms:AAT-007 Grapiprant RQ-00000007 | RQ-7
TypeSmall organic molecule
Emp. Form.C26H29N5O3S
Mol. Mass.491.605
SMILESCCc1nc2c(C)nc(C)cc2n1-c1ccc(CCNC(=O)NS(=O)(=O)c2ccc(C)cc2)cc1