Reaction Details
TargetLactoylglutathione lyase
LigandBDBM50045936
Substrate/Competitorn/a
Meas. Tech.ChEMBL_1648196 (CHEMBL3997252)
IC50 760±n/a nM
Citation Takasawa, RAkahane, HTanaka, HShimada, NYamamoto, TUchida-Maruki, HSai, MYoshimori, ATanuma, SI Piceatannol, a natural trans-stilbene compound, inhibits human glyoxalase I. Bioorg Med Chem Lett27:1169-1174 (2017) 
 
Lactoylglutathione lyase
Name:Lactoylglutathione lyase
Type:Enzyme
Mol. Mass.:20772.95
Organism:Homo sapiens (Human)
Description:Q04760
Residue:184
BDBM50045936
NameBDBM50045936
Synonyms:(E)-4-(3,5-dihydroxystyryl)benzene-1,2-diol 3,3',4,5'-tetrahydroxystilbene 3,4,3',5'-tetrahydroxystillbene 4-[(E)-2-(3,5-dihydroxyphenyl)vinyl]benzene-1,2-diol 4-[2-(3,5-dihydroxyphenyl)-(E)-1-ethenyl]-1,2-benzenediol CHEMBL69863 US11866416, Example 8 piceatanol | trans-3,3',4,5'-tetrahydroxystilbene
TypeSmall organic molecule
Emp. Form.C14H12O4
Mol. Mass.244.2427
SMILESOc1cc(O)cc(\C=C\c2ccc(O)c(O)c2)c1