Reaction Details
TargetLysyl oxidase homolog 2
LigandBDBM50232679
Substrate/Competitorn/a
Meas. Tech.ChEMBL_1648490 (CHEMBL3997546)
IC50 190±n/a nM
Citation Hutchinson, JHRowbottom, MWLonergan, DDarlington, JProdanovich, PKing, CDEvans, JFBain, G Small Molecule Lysyl Oxidase-like 2 (LOXL2) Inhibitors: The Identification of an Inhibitor Selective for LOXL2 over LOX. ACS Med Chem Lett8:423-427 (2017) 
 
Lysyl oxidase homolog 2
Name:Lysyl oxidase homolog 2
Type:PROTEIN
Mol. Mass.:86721.38
Organism:Homo sapiens (Human)
Description:ChEMBL_115990
Residue:774
BDBM50232679
NameBDBM50232679
Synonyms:CHEMBL4068784 | US11358936, Compound 4-5
TypeSmall organic molecule
Emp. Form.C6H7ClN2
Mol. Mass.142.586
SMILESNCc1ccnc(Cl)c1