Reaction Details
TargetLysyl oxidase homolog 2
LigandBDBM50232685
Substrate/Competitorn/a
Meas. Tech.ChEMBL_1648485 (CHEMBL3997541)
IC50 999±n/a nM
Citation Hutchinson, JHRowbottom, MWLonergan, DDarlington, JProdanovich, PKing, CDEvans, JFBain, G Small Molecule Lysyl Oxidase-like 2 (LOXL2) Inhibitors: The Identification of an Inhibitor Selective for LOXL2 over LOX. ACS Med Chem Lett8:423-427 (2017) 
 
Lysyl oxidase homolog 2
Name:Lysyl oxidase homolog 2
Type:PROTEIN
Mol. Mass.:86721.38
Organism:Homo sapiens (Human)
Description:ChEMBL_115990
Residue:774
BDBM50232685
NameBDBM50232685
Synonyms:CHEMBL4096085 | US11358936, Compound 4-4
TypeSmall organic molecule
Emp. Form.C7H7F3N2
Mol. Mass.176.1391
SMILESNCc1ccnc(c1)C(F)(F)F