Reaction Details
TargetLysyl oxidase homolog 2
LigandBDBM50232689
Substrate/Competitorn/a
Meas. Tech.ChEMBL_1648485 (CHEMBL3997541)
IC50 4970±n/a nM
Citation Hutchinson, JHRowbottom, MWLonergan, DDarlington, JProdanovich, PKing, CDEvans, JFBain, G Small Molecule Lysyl Oxidase-like 2 (LOXL2) Inhibitors: The Identification of an Inhibitor Selective for LOXL2 over LOX. ACS Med Chem Lett8:423-427 (2017) 
 
Lysyl oxidase homolog 2
Name:Lysyl oxidase homolog 2
Type:PROTEIN
Mol. Mass.:86721.38
Organism:Homo sapiens (Human)
Description:ChEMBL_115990
Residue:774
BDBM50232689
NameBDBM50232689
Synonyms:CHEMBL4098510
TypeSmall organic molecule
Emp. Form.C8H11N3
Mol. Mass.149.193
SMILESNCc1cccc(c1)C(N)=N