Reaction Details
TargetLysyl oxidase homolog 2
LigandBDBM50408793
Substrate/Competitorn/a
Meas. Tech.ChEMBL_1648485 (CHEMBL3997541)
IC50 3620±n/a nM
Citation Hutchinson, JHRowbottom, MWLonergan, DDarlington, JProdanovich, PKing, CDEvans, JFBain, G Small Molecule Lysyl Oxidase-like 2 (LOXL2) Inhibitors: The Identification of an Inhibitor Selective for LOXL2 over LOX. ACS Med Chem Lett8:423-427 (2017) 
 
Lysyl oxidase homolog 2
Name:Lysyl oxidase homolog 2
Type:PROTEIN
Mol. Mass.:86721.38
Organism:Homo sapiens (Human)
Description:ChEMBL_115990
Residue:774
BDBM50408793
NameBDBM50408793
Synonyms:CHEMBL148986
TypeSmall organic molecule
Emp. Form.C9H11NO2
Mol. Mass.165.1891
SMILESCOC(=O)c1ccc(CN)cc1